{"text_format":"1","workbook":"xlsx","n_sheets":3,"sheets":["ANA LİSTE ","KURUMSAL FİYAT LİSTESİ","Listede Olmayanlar"],"not_rendered":{"charts":0,"images":2,"macros":0,"external_links":0,"defined_names":4,"comments":0,"pivot_tables":0},"unopened":[],"bounds":{"document_bytes":16777216,"sheet_cells":100000,"rows_first":2000,"rows_last":500,"rows_between":2000,"halvings":0,"cell_chars":16384,"cell_head_chars":4096},"cells_cut":0,"cells_raw":0,"read":"whole","date_system":"1900"}

{"sheet":"ANA LİSTE ","index":0,"n_rows":1450,"n_cols":14,"rows_kept":1450,"cut":false,"hidden":true,"merged":[]}
["ADET BARKODU","NETSIS KODU","KOD","ADET BARKODU","ZIMBA MAKİNELERİ VE ZIMBA TELİ SÖKÜCÜLERİ","LİSTE FİYATI","NET FİYAT","BİRİM","KOLİ MİKTARI","KOLİ BARKODU","PAKET İÇİ MİKTARI","PAKET BARKODU","AMBALAJ","KDV"]
[8691217079006,131100079000,790,8691217079006,"Kollu Tel Zımba Makinesi (100 kağıt dikme kapasiteli)",203.09,null,"Adet",6,8691217079013,"-",null,"6 x 1 ad = 6",18]
[8691217079204,131100079200,792,8691217079204,"Kollu Tel Zımba Mak- 150 s,",263.55,null,"Adet",4,8691217079211,"-",null,"4 x 1 ad = 4",18]
[8691217079402,131100079400,794,8691217079402,"Kollu Tel Zımba Mak- 210 s,",316.45,null,"Adet",4,8691217079419,"-",null,"4 x 1 ad = 4",18]
[8691217079808,131100079800,798,8691217079808,"Tel Zımba Mak. Uzun Kollu - 320mm,",85.96,null,"Adet",12,8691217079815,"-",null,"12 x 1 ad = 12",18]
[8691217078795,131100078701,787,8691217078795,"Prime Tel Zimba Mak.No:24/6. - Siyah",34.01,null,"Adet",48,8691217178792,6,8691217278799,"8 pk x 6 ad = 48",18]
[8691217078788,131100078702,787,8691217078788,"Prime Tel Zimba Mak.No:24/6. - Mavi",34.01,null,"Adet",48,8691217178785,6,8691217278782,"8 pk x 6 ad = 48",18]
[8691217078771,131100078703,787,8691217078771,"Prime Tel Zimba Mak.No:24/6. - Kirmizi",34.01,null,"Adet",48,8691217178778,6,8691217278775,"8 pk x 6 ad = 48",18]
[8691217078597,131100078501,785,8691217078597,"FORCE TEL ZiMBA Mak. No:24/6. - Siyah",35.9,null,"Adet",48,8691217078696,6,8691217078498,"8 pk x 6 ad = 48",18]
[8691217078580,131100078502,785,8691217078580,"FORCE TEL ZiMBA Mak. No:24/6. - Mavi",35.9,null,"Adet",48,8691217078689,6,8691217078481,"8 pk x 6 ad = 48",18]
[8691217078566,131100078504,785,8691217078566,"FORCE TEL ZiMBA Mak. No:24/6. - Bordo",35.9,null,"Adet",48,8691217078665,6,8691217078467,"8 pk x 6 ad = 48",18]
[8691217078559,131100078505,785,8691217078559,"FORCE TEL ZiMBA Mak. No:24/6. - Yesil",35.9,null,"Adet",48,8691217078658,6,8691217078450,"8 pk x 6 ad = 48",18]
[8691217076067,131100076004,760,8691217076067,"Prıme Tel Zımba Makinası No:10 Gri",18.7,null,"Adet",108,8691217176064,12,8691217076166,"9 pk x 12 ad = 108",18]
[8691217075428,131100075401,754,8691217075428,"TEL ZIMBA MAK.No:10 - Siyah",8.19,null,"Adet",144,8691217075459,12,8691217075466,"12 pk x 12 ad = 144",18]
[8691217075411,131100075402,754,8691217075411,"TEL ZIMBA MAK.No:10 - Mavi",8.19,null,"Adet",144,8691217075442,12,8691217075473,"12 pk x 12 ad = 144",18]
[8691217075404,131100075403,754,8691217075404,"TEL ZIMBA MAK.No:10 - Gri",8.19,null,"Adet",144,8691217075435,12,8691217075480,"12 pk x 12 ad = 144",18]
[8691217075626,131100075601,756,8691217075626,"TEL ZIMBA MAK.No:10 - Siyah",12.6,null,"Adet",120,8691217075657,12,8691217075664,"10 pk x 12 ad = 120",18]
[8691217075619,131100075602,756,8691217075619,"TEL ZIMBA MAK.No:10 - Mavi",12.6,null,"Adet",120,8691217075640,12,8691217075671,"10 pk x 12 ad = 120",18]
[8691217075602,131100075603,756,8691217075602,"TEL ZIMBA MAK.No:10 - Gri",12.6,null,"Adet",120,8691217075633,12,8691217075688,"10 pk x 12 ad = 120",18]
[8691217075824,131100075801,758,8691217075824,"TEL ZIMBA MAK.No:24/6 - Siyah",18.89,null,"Adet",96,8691217075855,12,8691217075862,"8 pk x 12 ad = 96",18]
[8691217075817,131100075802,758,8691217075817,"TEL ZIMBA MAK.No:24/6 - Mavi",18.89,null,"Adet",96,8691217075848,12,8691217075879,"8 pk x 12 ad = 96",18]
[8691217075800,131100075803,758,8691217075800,"TEL ZIMBA MAK.No:24/6 - Gri",18.89,null,"Adet",96,8691217075831,12,8691217075886,"8 pk x 12 ad = 96",18]
[8691217074841,131100074804,748,8691217074841,"TEL ZIMBA MAK.-Dolphin-No:24/6 - Oranj",28.33,null,"Adet",36,null,"-",null,"36 x 1 ad = 36",18]
[8691217074834,131100074803,748,8691217074834,"TEL ZIMBA MAK.-Dolphin-No:24/6 - Pembe",28.33,null,"Adet",36,null,"-",null,"36 x 1 ad = 36",18]
[8691217074827,131100074802,748,8691217074827,"TEL ZIMBA MAK.-Dolphin-No:24/6 - Pembe",28.33,null,"Adet",36,null,"-",null,"36 x 1 ad = 36",18]
[8691217074810,131100074801,748,8691217074810,"TEL ZIMBA MAK.-Dolphin-No:24/6 - Mavi",28.33,null,"Adet",36,null,"-",null,"36 x 1 ad = 36",18]
[8691217074643,131100074604,746,8691217074643,"TEL ZIMBA MAK.-Dolphin-No:10 - Oranj",16.350000000000001,null,"Adet",1,null,"-",null,"72 x 1 ad = 72",18]
[8691217074636,131100074603,746,8691217074636,"TEL ZIMBA MAK.-Dolphin-No:10 - Pembe",16.350000000000001,null,"Adet",1,null,"-",null,"72 x 1 ad = 72",18]
[8691217074629,131100074602,746,8691217074629,"TEL ZIMBA MAK.-Dolphin-No:10 - Yesil",16.350000000000001,null,"Adet",1,null,"-",null,"72 x 1 ad = 72",18]
[8691217074612,131100074601,746,8691217074612,"TEL ZIMBA MAK.-Dolphin-No:10 - Mavi",16.350000000000001,null,"Adet",1,null,"-",null,"72 x 1 ad = 72",18]
[8691217074414,131100074400,744,8691217074414,"TEL ZIMBA MAK.-Power Saver Multi -No:24/6",176.63,null,"Adet",8,8691217074438,"-",null,"8 x 1 ad = 8",18]
[8691217074216,131100074200,742,8691217074216,"TEL ZIMBA MAK.-Power Saver-No:24/6",80.2,null,"Adet",16,8691217074230,"-",null,"16 x 1 ad = 16",18]
[8691217117098,131100117001,1170,8691217117098,"TEL ZIMBA - Diamond - No:10 - Siyah",16.899999999999999,null,"Adet",144,8691217217095,12,8691217317092,"12 x 12 ad = 144",18]
[8691217117081,131100117002,1170,8691217117081,"TEL ZIMBA - Diamond - No:10 - Mavi",16.899999999999999,null,"Adet",144,8691217217088,12,8691217317085,"12 x 12 ad = 144",18]
[8691217117074,131100117003,1170,8691217117074,"TEL ZIMBA - Diamond - No:10 - Kirmizi",16.899999999999999,null,"Adet",144,8691217217071,12,8691217317078,"12 x 12 ad = 144",18]
[8691217117296,131100117201,1172,8691217117296,"TEL ZIMBA - Diamond - No:24/6 - Siyah",34.01,null,"Adet",72,8691217217293,"-",null,"72 x 1 ad = 72",18]
[8691217117289,131100117202,1172,8691217117289,"TEL ZIMBA - Diamond - No:24/6 - Mavi",34.01,null,"Adet",72,8691217217286,"-",null,"72 x 1 ad = 72",18]
[8691217117272,131100117203,1172,8691217117272,"TEL ZIMBA - Diamond - No:24/6 - Kirmizi",34.01,null,"Adet",72,8691217217279,"-",null,"72 x 1 ad = 72",18]
[8691217118095,131100118001,1180,8691217118095,"TEL ZIMBA - Pense Tipi-Kaplama-No:10 - Siyah",17.309999999999999,null,"Adet",48,8691217218092,6,8691217318099,"8 kt x 6 ad = 48",18]
[8691217118088,131100118002,1180,8691217118088,"TEL ZIMBA - Pense Tipi-Kaplama-No:10 - Mavi",17.309999999999999,null,"Adet",48,8691217218085,6,8691217318082,"8 kt x 6 ad = 48",18]
[8691217118071,131100118003,1180,8691217118071,"TEL ZIMBA - Pense Tipi-Kaplama-No:10 - Kirmizi",17.309999999999999,null,"Adet",48,8691217218078,6,8691217318075,"8 kt x 6 ad = 48",18]
[8691217118101,131100118100,1181,8691217118101,"Tel Zımba - Pense Tipi-Krome-No:10",19.52,null,"Adet",48,8691217118118,6,8691217118125,"8 kt x 6 ad = 48",18]
[8691217118293,131100118201,1182,8691217118293,"TEL ZIMBA - Pense Tipi-Kaplama-No:24/6-Küçük - Siyah",25.5,null,"Adet",48,8691217218290,6,8691217318297,"8 kt x 6 ad = 48",18]
[8691217118286,131100118202,1182,8691217118286,"TEL ZIMBA - Pense Tipi-Kaplama-No:24/6-Küçük - Mavi",25.5,null,"Adet",48,8691217218283,6,8691217318280,"8 kt x 6 ad = 48",18]
[8691217118279,131100118203,1182,8691217118279,"TEL ZIMBA - Pense Tipi-Kaplama-No:24/6-Küçük - Kirmizi",25.5,null,"Adet",48,8691217218276,6,8691217318273,"8 kt x 6 ad = 48",18]
[8691217118491,131100118401,1184,8691217118491,"TEL ZIMBA - Pense Tipi-Kaplama-No:24/6-Büyük- Siyah",46.91,null,"Adet",36,8691217218498,6,8691217318495,"6 kt x 6 ad = 36",18]
[8691217118484,131100118402,1184,8691217118484,"TEL ZIMBA - Pense Tipi-Kaplama-No:24/6-Büyük - Mavi",46.91,null,"Adet",36,8691217218481,6,8691217318488,"6 kt x 6 ad = 36",18]
[8691217118477,131100118403,1184,8691217118477,"TEL ZIMBA - Pense Tipi-Kaplama-No:24/6-Büyük - Kirmizi",46.91,null,"Adet",36,8691217218474,6,8691217318471,"6 kt x 6 ad = 36",18]
[8691217118606,131100118600,1186,8691217118606,"Tel Zımba - Pense Tipi-Krome-No:24/6,",51.95,null,"Adet",36,8691217118613,6,8691217118620,"6 kt x 6 ad = 36",18]
[8691217119603,131100119600,1196,8691217119603,"Tel Zımba - Nova - No:10",22.67,null,"Adet",144,8691217119610,12,8691217119627,"12 kt x 12 ad = 144",18]
[8691217119801,131100119800,1198,8691217119801,"Tel Zımba - Nova - No:24/6",31.49,null,"Adet",72,8691217119818,6,8691217119825,"12 kt x 6 ad = 72",18]
[8691217120203,131100120200,1202,8691217120203,"TEL ZIMBA - Power Saver - No:10",51.01,null,"Adet",48,8691217120210,"-",null,"48 x 1 ad = 48",18]
[8691217120401,131100120400,1204,8691217120401,"TEL ZIMBA - Power Saver - No:24/6",58.88,null,"Adet",36,8691217120418,"-",null,"36 x 1 ad = 36",18]
[8691217120654,131100120604,1206,8691217120654,"TEL ZIMBA MAK.-StandUp-No:10 - Oranj",22.7,null,"Adet",48,null,"-",null,"72  x 1 ad = 72",18]
[8691217120678,131100120603,1206,8691217120678,"TEL ZIMBA MAK.-StandUp-No:10 - Pembe",22.7,null,"Adet",48,null,"-",null,"72  x 1 ad = 72",18]
[8691217120661,131100120602,1206,8691217120661,"TEL ZIMBA MAK.-StandUp-No:10 - Yesil",22.7,null,"Adet",48,null,"-",null,"72  x 1 ad = 72",18]
[8691217120647,131100120601,1206,8691217120647,"TEL ZIMBA MAK.-StandUp-No:10 - Mavi",22.7,null,"Adet",48,null,"-",null,"72  x 1 ad = 72",18]
[8691217120852,131100120804,1208,8691217120852,"TEL ZIMBA MAK.-StandUp-No:24/6 - Oranj",36.74,null,"Adet",48,null,"-",null,"36 x 1 ad = 36",18]
[8691217120876,131100120803,1208,8691217120876,"TEL ZIMBA MAK.-StandUp-No:24/6 - Pembe",36.74,null,"Adet",48,null,"-",null,"36 x 1 ad = 36",18]
[8691217120869,131100120802,1208,8691217120869,"TEL ZIMBA MAK.-StandUp-No:24/6 - Yesil",36.74,null,"Adet",48,null,"-",null,"36 x 1 ad = 36",18]
{"$rows_left_out":1391}
{"sheet":"KURUMSAL FİYAT LİSTESİ","index":1,"n_rows":1455,"n_cols":12,"rows_kept":1455,"cut":false,"hidden":false,"merged":[[3,1,3,10]]}
[]
[]
[]
[null,"28.08.2018 MAS FİYAT LİSTESİ"]
[null,"KOD","ADET BARKODU","PAKET BARKODU","KOLİ  BARKODU","ÜRÜN GRUBU / ÜRÜN ADI","BİRİM","AMBALAJ","LİSTE FİYATI","NET FİYAT","KDV"]
[null,"KOD","ADET BARKODU","PAKET BARKODU","KOLİ BARKODU","ZIMBA MAKİNELERİ VE ZIMBA TELİ SÖKÜCÜLERİ","BİRİM","AMBALAJ","LİSTE FİYATI","NET FİYAT","KDV","Netsis Stokodu"]
[null,790,8691217079006,null,8691217079013,"KOLLU TEL ZIMBA MAKİNESİ (100 KAĞIT DİKME KAPASİTELİ)","Adet","6 x 1 ad = 6",188.59,null,18,131100079000]
[null,792,8691217079204,null,8691217079211,"KOLLU TEL ZIMBA MAK- 150 S,","Adet","4 x 1 ad = 4",244.72,null,18,131100079200]
[null,794,8691217079402,null,8691217079419,"KOLLU TEL ZIMBA MAK- 210 S,","Adet","4 x 1 ad = 4",293.83999999999997,null,18,131100079400]
[null,798,8691217079808,null,8691217079815,"TEL ZIMBA MAK. UZUN KOLLU - 320MM,","Adet","12 x 1 ad = 12",79.819999999999993,null,18,131100079800]
[null,787,8691217078795,8691217278799,8691217178792,"PRİME TEL ZIMBA MAK.NO:24/6. - SİYAH","Adet","8 pk x 6 ad = 48",31.58,null,18,131100078701]
[null,787,8691217078788,8691217278782,8691217178785,"PRİME TEL ZIMBA MAK.NO:24/6. - MAVİ","Adet","8 pk x 6 ad = 48",31.58,null,18,131100078702]
[null,787,8691217078771,8691217278775,8691217178778,"PRİME TEL ZIMBA MAK.NO:24/6. - KIRMIZI","Adet","8 pk x 6 ad = 48",31.58,null,18,131100078703]
[null,785,8691217078597,8691217078498,8691217078696,"FORCE TEL ZIMBA MAK. NO:24/6. - SİYAH","Adet","8 pk x 6 ad = 48",33.33,null,18,131100078501]
[null,785,8691217078580,8691217078481,8691217078689,"FORCE TEL ZIMBA MAK. NO:24/6. - MAVİ","Adet","8 pk x 6 ad = 48",33.33,null,18,131100078502]
[null,785,8691217078566,8691217078467,8691217078665,"FORCE TEL ZIMBA MAK. NO:24/6. - BORDO","Adet","8 pk x 6 ad = 48",33.33,null,18,131100078504]
[null,785,8691217078559,8691217078450,8691217078658,"FORCE TEL ZIMBA MAK. NO:24/6. - YEŞİL","Adet","8 pk x 6 ad = 48",33.33,null,18,131100078505]
[null,760,8691217076067,8691217076166,8691217176064,"PRIME TEL ZIMBA MAKİNASI NO:10 GRİ","Adet","9 pk x 12 ad = 108",17.37,null,18,131100076004]
[null,754,8691217075428,8691217075466,8691217075459,"TEL ZIMBA MAK.NO:10 - SİYAH","Adet","12 pk x 12 ad = 144",7.6,null,18,131100075401]
[null,754,8691217075411,8691217075473,8691217075442,"TEL ZIMBA MAK.NO:10 - MAVİ","Adet","12 pk x 12 ad = 144",7.6,null,18,131100075402]
[null,754,8691217075404,8691217075480,8691217075435,"TEL ZIMBA MAK.NO:10 - GRİ","Adet","12 pk x 12 ad = 144",7.6,null,18,131100075403]
[null,756,8691217075626,8691217075664,8691217075657,"TEL ZIMBA MAK.NO:10 - SİYAH","Adet","10 pk x 12 ad = 120",11.7,null,18,131100075601]
[null,756,8691217075619,8691217075671,8691217075640,"TEL ZIMBA MAK.NO:10 - MAVİ","Adet","10 pk x 12 ad = 120",11.7,null,18,131100075602]
[null,756,8691217075602,8691217075688,8691217075633,"TEL ZIMBA MAK.NO:10 - GRİ","Adet","10 pk x 12 ad = 120",11.7,null,18,131100075603]
[null,758,8691217075824,8691217075862,8691217075855,"TEL ZIMBA MAK.NO:24/6 - SİYAH","Adet","8 pk x 12 ad = 96",17.54,null,18,131100075801]
[null,758,8691217075817,8691217075879,8691217075848,"TEL ZIMBA MAK.NO:24/6 - MAVİ","Adet","8 pk x 12 ad = 96",17.54,null,18,131100075802]
[null,758,8691217075800,8691217075886,8691217075831,"TEL ZIMBA MAK.NO:24/6 - GRİ","Adet","8 pk x 12 ad = 96",17.54,null,18,131100075803]
[null,748,8691217074841,null,null,"TEL ZIMBA MAK.-DOLPHİN-NO:24/6 - ORANJ","Adet","36 x 1 ad = 36",26.4,null,18,131100074804]
[null,748,8691217074834,null,null,"TEL ZIMBA MAK.-DOLPHİN-NO:24/6 - PEMBE","Adet","36 x 1 ad = 36",26.4,null,18,131100074803]
[null,748,8691217074827,null,null,"TEL ZIMBA MAK.-DOLPHİN-NO:24/6 - PEMBE","Adet","36 x 1 ad = 36",26.4,null,18,131100074802]
[null,748,8691217074810,null,null,"TEL ZIMBA MAK.-DOLPHİN-NO:24/6 - MAVİ","Adet","36 x 1 ad = 36",26.4,null,18,131100074801]
[null,746,8691217074643,null,null,"TEL ZIMBA MAK.-DOLPHİN-NO:10 - ORANJ","Adet","72 x 1 ad = 72",15.29,null,18,131100074604]
[null,746,8691217074636,null,null,"TEL ZIMBA MAK.-DOLPHİN-NO:10 - PEMBE","Adet","72 x 1 ad = 72",15.29,null,18,131100074603]
[null,746,8691217074629,null,null,"TEL ZIMBA MAK.-DOLPHİN-NO:10 - YEŞİL","Adet","72 x 1 ad = 72",15.29,null,18,131100074602]
[null,746,8691217074612,null,null,"TEL ZIMBA MAK.-DOLPHİN-NO:10 - MAVİ","Adet","72 x 1 ad = 72",15.29,null,18,131100074601]
[null,744,8691217074414,null,8691217074438,"TEL ZIMBA MAK.-POWER SAVER MULTİ -NO:24/6","Adet","8 x 1 ad = 8",164.02,null,18,131100074400]
[null,742,8691217074216,null,8691217074230,"TEL ZIMBA MAK.-POWER SAVER-NO:24/6","Adet","16 x 1 ad = 16",74.47,null,18,131100074200]
[null,1170,8691217117098,8691217317092,8691217217095,"TEL ZIMBA - DİAMOND - NO:10 - SİYAH","Adet","12 x 12 ad = 144",15.7,null,18,131100117001]
[null,1170,8691217117081,8691217317085,8691217217088,"TEL ZIMBA - DİAMOND - NO:10 - MAVİ","Adet","12 x 12 ad = 144",15.7,null,18,131100117002]
[null,1170,8691217117074,8691217317078,8691217217071,"TEL ZIMBA - DİAMOND - NO:10 - KIRMIZI","Adet","12 x 12 ad = 144",15.7,null,18,131100117003]
[null,1172,8691217117296,null,8691217217293,"TEL ZIMBA - DİAMOND - NO:24/6 - SİYAH","Adet","72 x 1 ad = 72",31.58,null,18,131100117201]
[null,1172,8691217117289,null,8691217217286,"TEL ZIMBA - DİAMOND - NO:24/6 - MAVİ","Adet","72 x 1 ad = 72",31.58,null,18,131100117202]
[null,1172,8691217117272,null,8691217217279,"TEL ZIMBA - DİAMOND - NO:24/6 - KIRMIZI","Adet","72 x 1 ad = 72",31.58,null,18,131100117203]
[null,1180,8691217118095,8691217318099,8691217218092,"TEL ZIMBA - PENSE TİPİ-KAPLAMA-NO:10 - SİYAH","Adet","8 kt x 6 ad = 48",16.079999999999998,null,18,131100118001]
[null,1180,8691217118088,8691217318082,8691217218085,"TEL ZIMBA - PENSE TİPİ-KAPLAMA-NO:10 - MAVİ","Adet","8 kt x 6 ad = 48",16.079999999999998,null,18,131100118002]
[null,1180,8691217118071,8691217318075,8691217218078,"TEL ZIMBA - PENSE TİPİ-KAPLAMA-NO:10 - KIRMIZI","Adet","8 kt x 6 ad = 48",16.079999999999998,null,18,131100118003]
[null,1181,8691217118101,8691217118125,8691217118118,"TEL ZIMBA - PENSE TİPİ-KROME-NO:10","Adet","8 kt x 6 ad = 48",18.12,null,18,131100118100]
[null,1182,8691217118293,8691217318297,8691217218290,"TEL ZIMBA - PENSE TİPİ-KAPLAMA-NO:24/6-KÜÇÜK - SİYAH","Adet","8 kt x 6 ad = 48",23.68,null,18,131100118201]
[null,1182,8691217118286,8691217318280,8691217218283,"TEL ZIMBA - PENSE TİPİ-KAPLAMA-NO:24/6-KÜÇÜK - MAVİ","Adet","8 kt x 6 ad = 48",23.68,null,18,131100118202]
[null,1182,8691217118279,8691217318273,8691217218276,"TEL ZIMBA - PENSE TİPİ-KAPLAMA-NO:24/6-KÜÇÜK - KIRMIZI","Adet","8 kt x 6 ad = 48",23.68,null,18,131100118203]
[null,1184,8691217118491,8691217318495,8691217218498,"TEL ZIMBA - PENSE TİPİ-KAPLAMA-NO:24/6-BÜYÜK- SİYAH","Adet","6 kt x 6 ad = 36",43.56,null,18,131100118401]
[null,1184,8691217118484,8691217318488,8691217218481,"TEL ZIMBA - PENSE TİPİ-KAPLAMA-NO:24/6-BÜYÜK - MAVİ","Adet","6 kt x 6 ad = 36",43.56,null,18,131100118402]
[null,1184,8691217118477,8691217318471,8691217218474,"TEL ZIMBA - PENSE TİPİ-KAPLAMA-NO:24/6-BÜYÜK - KIRMIZI","Adet","6 kt x 6 ad = 36",43.56,null,18,131100118403]
[null,1186,8691217118606,8691217118620,8691217118613,"TEL ZIMBA - PENSE TİPİ-KROME-NO:24/6,","Adet","6 kt x 6 ad = 36",48.24,null,18,131100118600]
[null,1196,8691217119603,8691217119627,8691217119610,"TEL ZIMBA - NOVA - NO:10","Adet","12 kt x 12 ad = 144",21.05,null,18,131100119600]
[null,1198,8691217119801,8691217119825,8691217119818,"TEL ZIMBA - NOVA - NO:24/6","Adet","12 kt x 6 ad = 72",29.24,null,18,131100119800]
[null,1202,8691217120203,null,8691217120210,"TEL ZIMBA - POWER SAVER - NO:10","Adet","48 x 1 ad = 48",47.36,null,18,131100120200]
[null,1204,8691217120401,null,8691217120418,"TEL ZIMBA - POWER SAVER - NO:24/6","Adet","36 x 1 ad = 36",54.68,null,18,131100120400]
[null,1206,8691217120654,null,null,"TEL ZIMBA MAK.-STANDUP-NO:10 - ORANJ","Adet","72  x 1 ad = 72",21.15,null,18,131100120604]
[null,1206,8691217120678,null,null,"TEL ZIMBA MAK.-STANDUP-NO:10 - PEMBE","Adet","72  x 1 ad = 72",21.15,null,18,131100120603]
{"$rows_left_out":1396}
{"sheet":"Listede Olmayanlar","index":2,"n_rows":37,"n_cols":10,"rows_kept":37,"cut":false,"hidden":true,"merged":[]}
[9157,8691217915700,{"$f":"VLOOKUP(B1,'ANA LİSTE '!A:B,2,0)","v":131500915700},8691217915724,8691217915717,"BİON PERMANENT MARKER - KİRMİZİ","Adet","24 kt x 12 ad = 288",1.1000000000000001,{"$f":"I1*1.2","v":1.32}]
[9165,8691217916509,{"$f":"VLOOKUP(B2,'ANA LİSTE '!A:B,2,0)","v":131500916500},8691217916523,8691217916516,"BİON PERMANENT MARKER - KESİK UC  - SİYAH","Adet","24 kt x 12 ad = 288",1.1000000000000001,{"$f":"I2*1.2","v":1.32}]
[9166,8691217916608,{"$f":"VLOOKUP(B3,'ANA LİSTE '!A:B,2,0)","v":131500916600},8691217916622,8691217916615,"BİON PERMANENT MARKER - KESİK UC - MAVİ","Adet","24 kt x 12 ad = 288",1.1000000000000001,1.32]
[9167,8691217916707,{"$f":"VLOOKUP(B4,'ANA LİSTE '!A:B,2,0)","v":131500916700},8691217916721,8691217916714,"BİON PERMANENT MARKER - KESİK UC - KİRMİZİ","Adet","24 kt x 12 ad = 288",1.1000000000000001,1.32]
[9172,8691217917209,{"$f":"VLOOKUP(B5,'ANA LİSTE '!A:B,2,0)","v":131500917200},8691217917223,8691217917216,"BİON PERMANENT MARKER - YUVARLAK UC - KİRMİZİ","Adet","24 kt x 12 ad = 288",0.7,0.84]
[6304,8691217630283,{"$f":"VLOOKUP(B6,'ANA LİSTE '!A:B,2,0)","v":131500630402},8691217630382,8691217630283,"TUKENMEZ KALEM-PLASTİK UC- MAVİ","Adet","40 kt*50 ad = 2000",0.15,0.18]
[6304,8691217630276,{"$f":"VLOOKUP(B7,'ANA LİSTE '!A:B,2,0)","v":131500630403},8691217630375,8691217630276,"TUKENMEZ KALEM-PLASTİK UC- KİRMİZİ","Adet","40 kt*50 ad = 2000",0.15,0.18]
[6306,8691217630191,{"$f":"VLOOKUP(B8,'ANA LİSTE '!A:B,2,0)","v":131500630601},8691217630597,8691217630191,"TUKENMEZ KALEM-METAL UC- SİYAH","Adet","40 kt*50 ad = 2000",0.18,0.216]
[6306,8691217630177,{"$f":"VLOOKUP(B9,'ANA LİSTE '!A:B,2,0)","v":131500630603},8691217630573,8691217630177,"TUKENMEZ KALEM-METAL UC- KİRMİZİ","Adet","40 kt*50 ad = 2000",0.18,0.216]
[6306,8691217630184,{"$f":"VLOOKUP(B10,'ANA LİSTE '!A:B,2,0)","v":131500630602},8691217630580,8691217630184,"TUKENMEZ KALEM-METAL UC- MAVİ","Adet","40 kt*50 ad = 2000",0.18,0.216]
[6308,8691217630993,{"$f":"VLOOKUP(B11,'ANA LİSTE '!A:B,2,0)","v":131500630801},8691217630795,8691217630993,"TUKENMEZ KALEM SEFFAF KAPAK-METAL UC- SİYAH","Adet","40 kt*50 ad = 2000",0.28999999999999998,0.34799999999999998]
[6310,8691217631297,{"$f":"VLOOKUP(B12,'ANA LİSTE '!A:B,2,0)","v":131500631001},8691217631198,8691217631297,"TUKENMEZ KALEM-MEKANİK- SİYAH","Adet","20 kt*50 ad = 1000",0.49,0.58799999999999997]
[6310,8691217631273,{"$f":"VLOOKUP(B13,'ANA LİSTE '!A:B,2,0)","v":131500631003},8691217631174,8691217631273,"TUKENMEZ KALEM-MEKANİK- KİRMİZİ","Adet","20 kt*50 ad = 1000",0.49,0.58799999999999997]
[6314,8691217631396,{"$f":"VLOOKUP(B14,'ANA LİSTE '!A:B,2,0)","v":131500631401},8691217631594,8691217631396,"TUKENMEZ KALEM -PLASTİK UC- 1.0MM-SİYAH","Adet","40 kt*50 ad = 2000",0.35,0.42]
[6314,8691217631372,{"$f":"VLOOKUP(B15,'ANA LİSTE '!A:B,2,0)","v":131500631403},8691217631570,8691217631372,"TUKENMEZ KALEM -PLASTİK UC- 1.0MM-KİRMİZİ","Adet","40 kt*50 ad = 2000",0.35,0.42]
[6316,8691217631358,{"$f":"VLOOKUP(B16,'ANA LİSTE '!A:B,2,0)","v":131500631603},8691217631778,8691217631358,"TUKENMEZ KALEM -PLASTİK UC- 0.7MM-KİRMİZİ","Adet","40 kt*50 ad = 2000",0.19,0.22799999999999998]
[6318,8691217631334,{"$f":"VLOOKUP(B17,'ANA LİSTE '!A:B,2,0)","v":131500631801},8691217631990,8691217631334,"TUKENMEZ KALEM -SEFFAF KAPAK-METAL UÇ- SİYAH","Adet","40 kt*50 ad = 2000",0.25,0.3]
[6318,8691217631877,{"$f":"VLOOKUP(B18,'ANA LİSTE '!A:B,2,0)","v":131500631803},8691217631976,8691217631327,"TUKENMEZ KALEM -SEFFAF KAPAK-METAL UÇ- KIRMIZI","Adet","40 kt*50 ad = 2000",0.25,0.3]
[6320,8691217632294,{"$f":"VLOOKUP(B19,'ANA LİSTE '!A:B,2,0)","v":131500632001},8691217632195,8691217632294,"TUKENMEZ KALEM -MEKANİK- SİYAH","Adet","20 kt*50 ad = 1000",0.25,0.3]
[6320,8691217632287,{"$f":"VLOOKUP(B20,'ANA LİSTE '!A:B,2,0)","v":131500632002},8691217632188,8691217632287,"TUKENMEZ KALEM -MEKANİK- MAVİ","Adet","20 kt*50 ad = 1000",0.25,0.3]
[6320,8691217632270,{"$f":"VLOOKUP(B21,'ANA LİSTE '!A:B,2,0)","v":131500632003},8691217632171,8691217632270,"TUKENMEZ KALEM -MEKANİK- KİRMİZİ","Adet","20 kt*50 ad = 1000",0.25,0.3]
[6324,8691217632539,{"$f":"VLOOKUP(B22,'ANA LİSTE '!A:B,2,0)","v":131500632403},8691217632638,8691217632539,"TÜKENMEZ KALEM-PLASTİK UÇ- 1.0MM-KİRMİZİ","Adet","40 kt*50 ad = 2000",0.25,0.3]
[6324,8691217632515,{"$f":"VLOOKUP(B23,'ANA LİSTE '!A:B,2,0)","v":131500632401},8691217632614,8691217632515,"TÜKENMEZ KALEM-PLASTİK UÇ- 1.0MM-SİYAH","Adet","40 kt*50 ad = 2000",0.25,0.3]
[6330,8691217633185,{"$f":"VLOOKUP(B24,'ANA LİSTE '!A:B,2,0)","v":131500633003},8691217633277,8691217633185,"SEMIJEL KALEM- MASTER BALL-KİRMİZİ","Adet","40 kt*50 ad = 2000",0.26,0.312]
[6330,8691217633192,{"$f":"VLOOKUP(B25,'ANA LİSTE '!A:B,2,0)","v":131500633001},8691217633291,8691217633192,"SEMIJEL KALEM- MASTER BALL-SİYAH","Adet","40 kt*50 ad = 2000",0.26,0.312]
[6335,8691217633536,{"$f":"VLOOKUP(B26,'ANA LİSTE '!A:B,2,0)","v":131500633501},8691217633567,8691217633536,"SEMİJEL KALEM- MASTER SPEED-SİYAH","Adet","40 kt*50 ad = 2000",0.27,0.32400000000000001]
[]
[]
[]
[]
[6314,8691217631389,{"$f":"VLOOKUP(B31,'ANA LİSTE '!A:B,2,0)","v":131500631402},8691217631587,8691217631389,"TUKENMEZ KALEM -PLASTİK UC- 1.0MM-MAVİ","Adet","40 kt*50 ad = 2000"]
[9171,8691217917100,{"$f":"VLOOKUP(B32,'ANA LİSTE '!A:B,2,0)","v":131500917100},8691217917124,8691217917117,"BİON PERMANENT MARKER - YUVARLAK UC - MAVİ","Adet","24 kt x 12 ad = 288"]
[6403,8691217640305,{"$f":"VLOOKUP(B33,'ANA LİSTE '!A:B,2,0)","v":131500640300},null,null,"FOSFORLU KALEM - 60Lİ STAND+120  YEDEK","stand",1]
[6404,8691217640404,{"$f":"VLOOKUP(B34,'ANA LİSTE '!A:B,2,0)","v":131500640400},null,null,"FOSFORLU KALEM -36Lİ KARTON STAND - DOLU","stand",1]
[9155,8691217915502,{"$f":"VLOOKUP(B35,'ANA LİSTE '!A:B,2,0)","v":131500915500},8691217915526,8691217915519,"BİON PERMANENT MARKER  -SİYAH","Adet","24 kt x 12 ad = 288"]
[9161,8691217916103,{"$f":"VLOOKUP(B36,'ANA LİSTE '!A:B,2,0)","v":131500916100},8691217916127,8691217916110,"BİON PERMANENT MARKER  MUREKKEBİ - MAVİ","Adet","12 kt x 12 ad = 144"]
[6310,8691217631280,{"$f":"VLOOKUP(B37,'ANA LİSTE '!A:B,2,0)","v":131500631002},8691217631181,8691217631280,"TUKENMEZ KALEM-MEKANİK- MAVİ","Adet","20 kt*50 ad = 1000"]